{"text_format":"1","workbook":"xlsx","n_sheets":5,"sheets":["Formulario","Variables","Simulador","Tarifas","seguros"],"not_rendered":{"charts":0,"images":6,"macros":1,"external_links":4,"defined_names":2,"comments":1,"pivot_tables":0},"unopened":[],"bounds":{"document_bytes":16777216,"sheet_cells":100000,"rows_first":2000,"rows_last":500,"rows_between":2000,"halvings":0,"cell_chars":16384,"cell_head_chars":4096},"cells_cut":0,"cells_raw":0,"read":"whole","date_system":"1900"}

{"sheet":"Formulario","index":0,"n_rows":27,"n_cols":3,"rows_kept":27,"cut":false,"hidden":false,"merged":[[26,1,28,2],[21,1,23,1],[21,2,23,2],[4,1,5,2]]}
[]
[]
[]
[]
[null,"INGRESE LOS DATOS PARA SIMULAR EL VALOR TOTAL UNIFICADO DEL CRÉDITO HIPOTECARIO"]
[]
[]
[null,"  Elija el uso del inmueble","Comercial"]
[null,"  Elija el tipo de vivienda","Nueva"]
[null,"  Elija el rango de edad del deudor","De 18 a 50 años"]
[null,"  Digite el valor del inmueble",150000000]
[null,"  Digite el valor del crédito",30874000]
[null,"  Con garantía hipotecaria","Si"]
[null,"  Tipo de inmueble (de la garantía)","Casa"]
[null,"  Valor del avalúo comercial del inmueble",100000000]
[null,"  Elija la categoría de la vivienda","No VIS"]
[null,"  Digite el Plazo",180]
[]
[null,"  Elija el sistema de crédito","UVR"]
[null,"  Elija el sistema de amortización","Cuota fija"]
{"$rows_left_out":8}
{"sheet":"Variables","index":1,"n_rows":46,"n_cols":12,"rows_kept":46,"cut":false,"hidden":true,"merged":[[1,7,1,9],[2,10,2,11],[11,10,11,11],[19,10,19,11]]}
[]
[null,"LISTA DESPLEGABLE",null,null,"TARIFAS",null,null,"FACTOR MENSUAL PARA COBRO DE SEGUROS"]
[null,null,null,null,"TARIFARIO A partir del 05 de Junio de 2023","IVA INCLUIDO",null,"Hipotecarios:",null,null,"VALOR DEL SEGURO"]
[null,"  Uso del inmueble",null,13300,"Certificaciones",{"$f":"D4*1.19","v":15827},null,"Edad","Con garantía hipotecaria","Sin garantía hipotecaria","Con garantía hipotecaria","Sin garantía hipotecaria"]
[null,"Vivienda",null,59900,"Gastos de documentación",{"$f":"D5*1.19","v":71281},null,"Entre 18 y 51 años",4.4000000000000002E-4,6.9499999999999998E-4,{"$f":"Formulario!$C$12*Variables!$I5","v":13584.560000000001},{"$f":"Formulario!$C$12*Variables!$J5","v":21457.43}]
[null,"Comercial",null,112500,"Estudio de Créditos - VIS",133875,null,"Entre 51 y 60 años",4.4000000000000002E-4,8.9900000000000006E-4,{"$f":"Formulario!$C$12*Variables!$I6","v":13584.560000000001},{"$f":"Formulario!$C$12*Variables!$J6","v":27755.726000000002}]
[null,null,null,181750,"Estudio de Créditos - No VIS",216282.5,null,"Entre 61 y 70 años",4.4000000000000002E-4,9.2800000000000001E-4,{"$f":"Formulario!$C$12*Variables!$I7","v":13584.560000000001},{"$f":"Formulario!$C$12*Variables!$J7","v":28651.072}]
[null,"  Tipo de Vivienda",null,86500,"Levantamiento de hipoteca (elaboración de la minuta y otros)",102935,null,"Entre 71 y 75 años",4.4000000000000002E-4,2.7139999999999998E-3,{"$f":"Formulario!$C$12*Variables!$I8","v":13584.560000000001},{"$f":"Formulario!$C$12*Variables!$J8","v":83792.035999999993}]
[null,"Nueva",null,329450,"Estudio de títulos - Tarifa máxima",392045.5,null,"Entre 76 y 80 años",4.4000000000000002E-4,6.5179999999999995E-3,{"$f":"Formulario!$C$12*Variables!$I9","v":13584.560000000001},{"$f":"Formulario!$C$12*Variables!$J9","v":201236.73199999999}]
[null,"Usada",null,null,null,null,null,"81 años en adelante",4.4000000000000002E-4,1.0725E-2,{"$f":"Formulario!$C$12*Variables!$I10","v":13584.560000000001},{"$f":"Formulario!$C$12*Variables!$J10","v":331123.65000000002}]
[]
[null,"  Categoría de la vivienda",null,null,null,null,null,"Consumo, educativo, libranza:",null,null,"VALOR DEL SEGURO"]
[null,"VIS",null,null,null,null,null,"Edad","Con garantía hipotecaria","Sin garantía hipotecaria","Con garantía hipotecaria","Sin garantía hipotecaria"]
[null,"No VIS",null,null,null,null,null,"Entre 18 y 51 años",4.4000000000000002E-4,6.9499999999999998E-4,0,0]
[null,null,null,null,null,null,null,"Entre 51 y 60 años",4.4000000000000002E-4,8.9900000000000006E-4,0,0]
[null,"  Sistema de crédito",null,null,null,null,null,"Entre 61 y 70 años",4.4000000000000002E-4,9.2800000000000001E-4,0,0]
[null,"Pesos",null,null,null,null,null,"Entre 71 y 75 años",4.4000000000000002E-4,2.7139999999999998E-3,0,0]
[null,"UVR",null,null,null,null,null,"Entre 76 y 80 años",4.4000000000000002E-4,6.5179999999999995E-3,0,0]
[null,null,null,null,null,null,null,"81 años en adelante",4.4000000000000002E-4,1.0725E-2,0,0]
[null,"  Sistema de amortización",null,null,null,null,null,null,null,null,"VALOR DEL SEGURO"]
{"$rows_left_out":27}
{"sheet":"Simulador","index":2,"n_rows":321,"n_cols":30,"rows_kept":321,"cut":false,"hidden":true,"merged":[[6,20,6,21],[5,20,5,21],[0,24,0,26],[37,1,44,2],[17,8,17,13],[17,15,17,18],[17,20,17,28],[7,17,8,18],[4,1,5,2]]}
[null,null,null,null,null,null,null,null,null,null,null,null,null,null,null,null,null,null,null,null,null,null,null,"los % de seguros sale de la tabla seguros productos","TASA MENSUAL EN % POR RANGOS DE EDAD PARA COBRO DE SEGURO DE VIDA"]
[null,null,null,null,null,null,null,null,null,null,null,null,null,null,null,null,null,null,null,null,"Certificaciones",15600,null,null,"CON GARANTIA HIPO","SI","NO"]
[null,null,null,null,null,null,null,null,null,null,null,null,null,null,null,null,null,null,null,null,null,null,null,null,"De 18 a 50 años",4.1000000000000002E-2,6.9499999999999992E-2]
[null,null,null,null,null,null,null,null,null,null,null,null,null,null,null,null,null,null,null,null,"Estudio de Créditos - VIS","VIS",130300,null,"De 51 a 60 años",4.1000000000000002E-2,8.9900000000000008E-2]
[null,"SIMULACIÓN VALOR TOTAL UNIFICADO DEL CRÉDITO HIPOTECARIO",null,null,null,null,null,null,null,null,null,null,null,null,null,null,null,null,null,null,"Estudio de Créditos - No VIS","No VIS",211300,null,"De 61 a 70 años",4.1000000000000002E-2,9.2799999999999994E-2]
[null,null,null,null,null,null,null,null,null,null,null,null,null,null,null,null,null,null,null,null,"Gastos de Documentación",null,89850,null,"De 71 a 75 años",4.1000000000000002E-2,0.27139999999999997]
[null,null,{"$f":"TODAY()","v":"2025-10-17"},null,null,null,null,null,null,"Actualizar datos",null,null,null,null,null,null,null,null,null,null,"Estudio de títulos - Tarifa máxima",null,382950,null,"De 76 a 80 años",4.1000000000000002E-2,0.65179999999999993]
[null,"  Uso del inmueble",{"$f":"Formulario!C8","v":"Comercial"},null,null,null,null,null,null,null,null,null,null,null,null,null,null,"% A TENER EN CUENTA PARA COSTO AVALUO",null,null,"ACTUALIZADO TARIFAS 4 SEPTIEMBRE 2025",null,null,null,"Desde 81 años",4.1000000000000002E-2,1.0725]
[null,"  Tipo de Vivienda",{"$f":"Formulario!C9","v":"Nueva"},null,null,null,null,null,null,"TEA","TNM","CUOTA"]
[null,"  Rango de edad del deudor",{"$f":"Formulario!C10","v":"De 18 a 50 años"},null,null,null,null,null,"Valor UVR",372.3458,"https://www.banrep.gov.co/es/estadisticas/unidad-valor-real-uvr",null,null,null,null,null,null,"VIS",0.8,null,null,"Etiquetas de fila","% DEL VALOR TOTAL","Máx. de POND AVA OK"]
[null,"  Valor Inmueble",{"$f":"Formulario!C11","v":150000000},null,null,null,null,null,"IPC Ult 12 meses",7.1599999999999997E-2,{"$f":"(1+J11)^(1/12)-1","v":5.7793747418921626E-3},null,null,null,null,null,null,"NO VIS",0.7,null,null,"No Vis_Pesos",{"$f":"+S11","v":0.7},2.5999999999999999E-3,"TIPO DE SEGURO"]
[null,"  Desembolso",{"$f":"Formulario!C12","v":30874000},null,null,null,null,null,"Tasa UVR",{"$f":"Formulario!C22","v":6.5000000000000002E-2},{"$f":"(1+J12)^(1/12)-1","v":5.2616942768477504E-3},{"$f":"PMT(K12,Formulario!$C$17,-Simulador!$N$21)","v":713.85096817016097},null,null,null,null,{"$f":"+CONCATENATE(C16,\"_\",C18)","v":"No VIS_UVR"},{"$f":"+VLOOKUP(C16,$R$10:$S$11,2,0)","v":0.7},{"$f":"+VLOOKUP(Q12,$V$10:$X$14,3,0)","v":2.2000000000000001E-3},null,null,"No Vis_UVR",{"$f":"+S11","v":0.7},2.2000000000000001E-3,"Incendio",6.4999999999999997E-4]
[null,"  Con garantía hipotecaria",{"$f":"Formulario!C13","v":"Si"},null,null,null,null,null,"Tasa EA Pesos",{"$f":"Formulario!C22","v":6.5000000000000002E-2},{"$f":"(1+J13)^(1/12)-1","v":5.2616942768477504E-3},{"$f":"PMT(K13,Formulario!$C$17,-Simulador!$N$21)","v":713.85096817016097},null,null,null,null,null,null,null,null,null,"Vis_Pesos",{"$f":"+S10","v":0.8},3.0999999999999999E-3,"Terremoto",1.235E-2]
[null,"  Tipo de inmueble (de la garantía)",{"$f":"Formulario!C14","v":"Casa"},null,null,null,null,null,null,null,null,null,null,null,null,null,null,null,null,null,null,"Vis_UVR",{"$f":"+S10","v":0.8},1.15E-2,"IN+TERR",{"$f":"SUM(Z12:Z13)/100","v":1.2999999999999999E-4}]
[null,"  Valor del avalúo comercial del inmueble",{"$f":"Formulario!C15","v":100000000},null,null,null,null,null,null,null,null,null,null,null,null,null,null,null,null,null,null,"Total general"]
[null,"  Categoría de la vivienda",{"$f":"Formulario!C16","v":"No VIS"},null,null,null,null,null,null,null,null,null,null,null,null,null,null,null,null,null,null,null,null,null,null,null,null,"VTUA%",{"$f":"IRR(AD21:AD321)","v":1.1995534980189015E-2}]
[null,"  Plazo (meses)",{"$f":"Formulario!C17","v":180}]
[null,"  Sistema de Crédito",{"$f":"Formulario!C19","v":"UVR"},null,null,null,null,null,"FLUJO DEL CRÉDITO",null,null,null,null,null,null,"FLUJO EN $",null,null,null,null,"FLUJO DEL CLIENTE"]
[null,"  Sistema de amortización",{"$f":"Formulario!C20","v":"Cuota fija"},null,null,null,null,null,null,null,null,null,null,null,null,null,null,null,null,null,null,null,null,null,null,{"$f":"+INDEX($Y$2:$AA$8,MATCH(C10,Y2:Y8,0),MATCH(C13,Y2:AA2,0))","v":4.1000000000000002E-2}]
[null,{"$f":"IF(C18=\"Pesos\",\"  Tasa en Pesos E.A.\",\"  Tasa: Spread sobre la UVR\")","v":"  Tasa: Spread sobre la UVR"},{"$f":"Formulario!C22","v":6.5000000000000002E-2},null,null,null,null,null,"Periodo","Capital","Intereses","Abono a Capital","Cuota","Saldo",null,"Valor UVR","Interés $","Cuota $","Saldo $",null,"Desembolso","Cuota","Certificaciones","Gastos de documentación","Estudio de crédito","Estudio de títulos","costo Avaluo","Seguro de vida","Seguro de incendio y terremoto","Saldo cliente"]
{"$rows_left_out":302}
{"sheet":"Tarifas","index":3,"n_rows":372,"n_cols":19,"rows_kept":372,"cut":false,"hidden":true,"merged":[[4,2,13,2],[4,5,4,6],[5,5,5,6],[6,5,6,6],[7,5,7,6],[8,5,8,6],[9,5,9,6],[10,5,10,6],[11,5,11,6],[12,5,13,5],[14,2,14,6],[15,2,15,6],[16,2,16,6],[17,2,17,6],[18,2,18,6],[19,2,33,2],[19,5,22,5],[23,5,23,6],[24,5,24,6],[25,5,25,6],[32,5,32,6],[33,5,33,6],[34,2,34,6],[35,2,35,6],[36,2,36,6],[37,2,37,6],[26,5,26,6],[27,5,27,6],[28,5,28,6],[29,5,29,6],[30,5,30,6],[31,5,31,6],[49,5,49,6],[50,5,50,6],[51,5,51,6],[52,5,52,6],[53,5,53,6],[54,5,54,6],[38,2,38,6],[41,2,54,2],[41,5,41,6],[42,5,42,6],[43,5,43,6],[44,5,44,6],[45,5,45,6],[46,5,46,6],[47,5,47,6],[48,5,48,6],[55,2,55,6],[55,7,55,9],[56,2,61,2],[56,5,56,6],[57,5,57,6],[58,5,58,6],[59,5,59,6],[60,5,60,6],[61,5,61,6],[71,2,75,2],[71,5,71,6],[72,5,72,6],[73,5,73,6],[74,5,74,6],[75,5,75,6],[62,2,62,6],[63,2,70,2],[63,5,63,6],[64,5,64,6],[65,5,65,6],[66,5,66,6],[67,5,67,6],[68,5,68,6],[69,5,69,6],[70,5,70,6],[87,5,87,6],[88,5,88,6],[89,5,89,6],[90,5,90,6],[91,5,91,6],[92,5,92,6],[78,2,104,2],[78,5,78,6],[79,5,79,6],[80,5,80,6],[81,5,81,6],[82,5,82,6],[83,5,83,6],[84,5,84,6],[85,5,85,6],[86,5,86,6],[99,5,99,6],[100,5,100,6],[101,5,101,6],[102,5,102,6],[103,5,103,6],[104,5,104,6],[93,5,93,6],[94,5,94,6],[95,5,95,6],[96,5,96,6],[97,5,97,6],[98,5,98,6],[116,5,116,6],[117,5,117,6],[118,5,118,6],[119,5,119,6],[120,5,120,6],[121,5,121,6],[107,2,135,2],[107,5,107,6],[108,5,108,6],[109,5,109,6],[110,5,110,6],[111,5,111,6],[112,5,112,6],[113,5,113,6],[114,5,114,6],[115,5,115,6],[128,5,128,6],[129,5,129,6],[130,5,130,6],[131,5,131,6],[132,5,132,6],[133,5,133,6],[122,5,122,6],[123,5,123,6],[124,5,124,6],[125,5,125,6],[126,5,126,6],[127,5,127,6],[134,5,134,6],[135,5,135,6],[138,2,146,2],[138,5,138,6],[139,5,139,6],[140,5,140,6],[141,5,141,6],[142,5,142,6],[143,5,143,6],[144,5,144,6],[145,5,145,6],[146,5,146,6],[165,2,165,6],[166,2,166,6],[167,2,167,6],[156,5,156,6],[157,5,157,6],[158,5,158,6],[159,5,159,6],[160,5,160,6],[161,5,161,6],[149,2,164,2],[149,5,149,6],[150,5,150,6],[151,5,151,6],[152,5,152,6],[153,5,153,6],[154,5,154,6],[155,5,155,6],[162,5,162,6],[163,5,163,6],[164,5,164,6],[179,5,179,6],[180,5,180,6],[181,5,181,6],[182,5,182,6],[183,5,183,6],[184,5,184,6],[168,2,168,6],[171,2,184,2],[171,5,171,6],[172,5,172,6],[173,5,173,6],[174,5,174,6],[175,5,175,6],[176,5,176,6],[177,5,177,6],[178,5,178,6],[185,2,185,6],[186,2,188,2],[186,5,186,6],[187,5,187,6],[188,5,188,6],[189,2,191,2],[189,5,189,6],[190,5,190,6],[191,5,191,6],[202,5,202,6],[203,5,203,6],[204,5,204,6],[205,5,205,6],[206,5,206,6],[207,5,207,6],[192,2,194,2],[192,5,192,6],[193,5,193,6],[194,5,194,6],[197,2,220,2],[197,5,197,6],[198,5,198,6],[199,5,199,6],[200,5,200,6],[201,5,201,6],[214,5,214,6],[215,5,215,6],[216,5,216,6],[217,5,217,6],[218,5,218,6],[219,5,219,6],[208,5,208,6],[209,5,209,6],[210,5,210,6],[211,5,211,6],[212,5,212,6],[213,5,213,6],[220,5,220,6],[221,2,221,6],[222,2,222,6],[223,2,223,6],[224,2,224,6],[227,2,236,2],[227,5,227,6],[228,5,228,6],[229,5,229,6],[230,5,230,6],[237,2,237,6],[238,2,242,2],[238,5,238,6],[239,5,239,6],[240,5,240,6],[241,5,241,6],[242,5,242,6],[231,5,231,6],[232,5,232,6],[233,5,233,6],[234,5,234,6],[235,5,235,6],[236,5,236,6],[252,2,256,2],[252,5,252,6],[253,5,253,6],[254,5,254,6],[255,5,255,6],[256,5,256,6],[243,2,243,6],[244,2,250,2],[244,5,244,6],[245,5,245,6],[246,5,246,6],[247,5,247,6],[248,5,248,6],[249,5,249,6],[250,5,250,6],[265,2,269,2],[265,5,265,6],[266,5,266,6],[267,5,267,6],[268,5,268,6],[269,5,269,6],[259,2,262,2],[259,5,259,6],[260,5,260,6],[261,5,261,6],[262,5,262,6],[263,2,264,2],[263,5,263,6],[264,5,264,6],[276,2,281,2],[276,5,276,6],[277,5,277,6],[278,5,278,6],[279,5,279,6],[280,5,280,6],[281,5,281,6],[270,2,275,2],[270,5,270,6],[271,5,271,6],[272,5,272,6],[273,5,273,6],[274,5,274,6],[275,5,275,6],[298,12,301,12],[299,5,299,6],[300,5,300,6],[301,5,301,6],[302,5,302,6],[302,8,303,8],[303,5,303,6],[293,5,293,6],[294,5,294,6],[295,5,295,6],[296,2,296,9],[298,2,303,2],[298,5,298,6],[298,9,301,9],[284,2,295,2],[284,5,284,6],[285,5,285,6],[286,5,286,6],[287,5,287,6],[288,5,288,6],[289,5,289,6],[290,5,290,6],[291,5,291,6],[292,5,292,6],[304,2,304,9],[306,2,313,2],[306,5,306,6],[307,5,307,6],[308,5,308,6],[309,5,309,6],[310,5,310,6],[311,5,311,6],[312,5,312,6],[313,5,313,6],[314,2,314,6],[315,2,336,2],[315,5,315,6],[316,5,316,6],[317,5,317,6],[318,5,318,6],[319,5,319,6],[320,5,320,6],[321,5,321,6],[322,5,322,6],[329,5,329,6],[330,5,330,6],[331,5,331,6],[332,5,332,6],[333,5,333,6],[334,5,334,6],[323,5,323,6],[324,5,324,6],[325,5,325,6],[326,5,326,6],[327,5,327,6],[328,5,328,6],[342,2,346,2],[342,5,342,6],[343,5,343,6],[344,5,344,6],[345,5,345,6],[346,5,346,6],[335,5,335,6],[336,5,336,6],[337,2,337,6],[338,2,338,6],[339,2,339,6],[340,2,340,6],[347,5,347,6],[348,2,348,6],[349,2,349,6],[350,2,366,2],[350,5,350,6],[351,5,351,6],[352,5,352,6],[353,5,353,6],[354,5,354,6],[355,5,355,6],[368,2,368,12],[369,2,370,12],[362,5,362,6],[363,5,363,6],[364,5,364,6],[365,5,365,6],[366,5,366,6],[367,2,367,6],[356,5,356,6],[357,5,357,6],[358,5,358,6],[359,5,359,6],[360,5,360,6],[361,5,361,6]]}
[]
[]
[null,null,"TARIFAS PRODUCTOS Y SERVICIOS BANCARIOS",null,null,null,null,null,"A partir del 13 de Marzo de 2023","A partir del 01 de Diciembre de 2023",null,null,"A partir del 02 de Julio de 2024"]
[null,null,"A",null,null,null,null,null,"TARIFA","TARIFA",null,null,"TARIFA",null,null,"Tarifa Dic 16","Tarifa Mar 17","Validador","Tarifa Dic 01 2023"]
[null,114005,"Medios de Manejo 1",1,{"$f":"+D5&$C$4","v":"1A"},"Entrega medio de manejo (en apertura de cuenta)",null,null,"Sin costo","Sin costo",null,{"$f":"#REF!=J5","v":{"$error":"#REF!"}},{"$f":"+S5","v":"Sin costo"},null,null,{"$f":"+IF(VLOOKUP(F5,'[1]TOTAL Aumento'!$H$15:$X$504,16,FALSE)=0,\"Sin costo\",VLOOKUP(F5,'[1]TOTAL Aumento'!$H$15:$X$504,16,FALSE))","v":"Sin costo"},{"$f":"+IF(VLOOKUP(F5,'[2]TOTAL Aumento'!$H$15:$AE$472,18,FALSE)=0,\"Sin costo\",VLOOKUP(F5,'[2]TOTAL Aumento'!$H$15:$Z$472,18,FALSE))","v":"Sin costo"},{"$f":"IF(Q5>P5,\"Incremento\",0)","v":0},{"$f":"+IF(VLOOKUP(F5,'[3]tarifas 2024'!$H$15:$W$386,16,FALSE)=0,\"Sin costo\",VLOOKUP(F5,'[3]tarifas 2024'!$H$15:$W$386,16,FALSE))","v":"Sin costo"}]
[null,114010,null,{"$f":"+D5+1","v":2},{"$f":"+D6&$C$4","v":"2A"},"Entrega medio de manejo amparado (en apertura de cuenta)",null,null,"Sin costo","Sin costo",null,{"$f":"#REF!=J6","v":{"$error":"#REF!"}},{"$f":"+S6","v":"Sin costo"},null,null,{"$f":"+IF(VLOOKUP(F6,'[1]TOTAL Aumento'!$H$15:$X$504,16,FALSE)=0,\"Sin costo\",VLOOKUP(F6,'[1]TOTAL Aumento'!$H$15:$X$504,16,FALSE))","v":"Sin costo"},{"$f":"+IF(VLOOKUP(F6,'[2]TOTAL Aumento'!$H$15:$AE$472,18,FALSE)=0,\"Sin costo\",VLOOKUP(F6,'[2]TOTAL Aumento'!$H$15:$Z$472,18,FALSE))","v":"Sin costo"},{"$f":"IF(Q6>P6,\"Incremento\",0)","v":0},{"$f":"+IF(VLOOKUP(F6,'[3]tarifas 2024'!$H$15:$W$386,16,FALSE)=0,\"Sin costo\",VLOOKUP(F6,'[3]tarifas 2024'!$H$15:$W$386,16,FALSE))","v":"Sin costo"}]
[null,null,null,{"$f":"+D6+1","v":3},"3A","Entrega Medio de manejo adicional",null,null,10650,10850,null,{"$f":"#REF!=J7","v":{"$error":"#REF!"}},11950,null,null,{"$f":"+IF(VLOOKUP(F7,'[1]TOTAL Aumento'!$H$15:$X$504,16,FALSE)=0,\"Sin costo\",VLOOKUP(F7,'[1]TOTAL Aumento'!$H$15:$X$504,16,FALSE))","v":10650},{"$f":"+IF(VLOOKUP(F7,'[2]TOTAL Aumento'!$H$15:$AE$472,18,FALSE)=0,\"Sin costo\",VLOOKUP(F7,'[2]TOTAL Aumento'!$H$15:$Z$472,18,FALSE))","v":10850},"Incremento",{"$f":"+IF(VLOOKUP(F7,'[3]tarifas 2024'!$H$15:$W$386,16,FALSE)=0,\"Sin costo\",VLOOKUP(F7,'[3]tarifas 2024'!$H$15:$W$386,16,FALSE))","v":11950}]
[null,null,null,4,"4A","Entrega medio de manejo amparado adicional ",null,null,10650,10850,null,{"$f":"#REF!=J8","v":{"$error":"#REF!"}},11950,null,null,{"$f":"+IF(VLOOKUP(F8,'[1]TOTAL Aumento'!$H$15:$X$504,16,FALSE)=0,\"Sin costo\",VLOOKUP(F8,'[1]TOTAL Aumento'!$H$15:$X$504,16,FALSE))","v":10650},{"$f":"+IF(VLOOKUP(F8,'[2]TOTAL Aumento'!$H$15:$AE$472,18,FALSE)=0,\"Sin costo\",VLOOKUP(F8,'[2]TOTAL Aumento'!$H$15:$Z$472,18,FALSE))","v":10850},"Incremento",{"$f":"+IF(VLOOKUP(F8,'[3]tarifas 2024'!$H$15:$W$386,16,FALSE)=0,\"Sin costo\",VLOOKUP(F8,'[3]tarifas 2024'!$H$15:$W$386,16,FALSE))","v":11950}]
[null,null,null,5,"5A","Cuota de Manejo medio de manejo - Cuenta /Deposito Digital*3*",null,null,4200,4300,null,{"$f":"#REF!=J9","v":{"$error":"#REF!"}},4750,null,null,4200,4300,"Incremento",4750]
[null,null,null,6,"6A","Cuota de manejo medio de manejo amparado*. (mes anticipado)4*",null,114010,12350,12500,null,{"$f":"#REF!=J10","v":{"$error":"#REF!"}},13750,null,null,12350,12500,"Incremento",13750]
[null,null,null,7,"7A","Cuota de manejo medio de Manejo. (mes anticipado)2 y 4*",null,114005,15900,16490,null,{"$f":"#REF!=J11","v":{"$error":"#REF!"}},19750,null,null,15900,16490,"Incremento",19750]
[null,null,null,8,"8A","Valor reexpedición tarjeta débito.",null,114030,19900,20200,1,{"$f":"#REF!=J12","v":{"$error":"#REF!"}},24990,null,null,19900,20200,"Incremento",24990]
[null,null,null,9,"9A","Cuota de manejo Rentavillas Junior (mes anticipado.)","Para cuentas con saldos superiores a $1.000.000",null,10050,10250,null,{"$f":"#REF!=J13","v":{"$error":"#REF!"}},11300,null,null,10050,10250,"Incremento",11300]
[null,null,null,10,"10A",null,"Para cuentas con saldos inferiores a $1.000.000",null,15900,16150,null,{"$f":"#REF!=J14","v":{"$error":"#REF!"}},17800,null,null,15900,16150,"Incremento",17800]
[null,null,"1 Medios de manejo incluyen tarjeta debito"]
[null,null,"2 Aplica para cuentas nómina con y sin convenio"]
[null,null,"3 Para cuentas de nómina aperturadas por el canal digital sin costo de cuota de manejo"]
[null,null,"4 Por el pago de estas comisiones tendra acceso a las siguientes transacciones establecidas por la ley 2009 del 27 de Diciembre de 2019: Consultas en red propia,  Certificación bancaria y Copia de extracto en papel y por internet."]
[null,"B","* Aplica para saldos promedio mes inferiores a $500.000"]
[null,115005,"Transacciones con Tarjeta Débito",1,{"$f":"+D20&$B$19","v":"1B"},"Transacciones en Cajeros Red Aval","Retiros y Consultas**",115005,2390,2450,null,{"$f":"#REF!=J20","v":{"$error":"#REF!"}},{"$f":"+S20","v":2950},null,null,2390,2450,{"$f":"IF(Q20>P20,\"Incremento\",0)","v":"Incremento"},2950]
{"$rows_left_out":353}
{"sheet":"seguros","index":4,"n_rows":25,"n_cols":16,"rows_kept":25,"cut":false,"hidden":true,"merged":[[2,7,3,7],[2,8,3,8],[12,0,13,0],[12,1,13,1],[12,2,13,2],[12,3,13,3],[12,4,13,4],[12,5,12,6],[12,7,13,7],[12,8,13,8],[2,0,3,0],[2,1,3,1],[2,2,3,2],[2,3,3,3],[2,4,3,4],[2,5,2,6],[12,9,13,14],[14,9,14,14],[15,9,15,14],[17,0,18,0],[17,1,18,1],[17,2,18,2],[17,3,18,3],[17,4,18,4],[17,5,17,6],[17,7,18,7],[23,9,23,14],[24,9,24,14],[17,8,18,8],[17,9,18,14],[19,9,19,14],[20,9,20,14],[21,9,21,14],[22,9,22,14]]}
[]
[]
["LINEA DE CRÉDITO","ASOCIACIÓN DE GARANTÍA HIPOTECARIA","TIPO DE SEGURO","ASEGURADORA","NIT","VIGENCIA DE LOS FACTORES",null,"VALOR ASEGURADO \n(BASE DE LIQUIDACIÓN)","CONDICIONES DE COBRO","TASA MENSUAL EN % POR RANGOS DE EDAD PARA COBRO DE SEGURO DE VIDA"]
[null,null,null,null,null,"DESDE","HASTA",null,null,"De 18 a 50 años","De 51 a 60 años","De 61 a 70 años","De 71 a 75 años","De 76 a 80 años","Desde 81 años"]
["Hipotecario largo plazo","CON garantía hipotecaria","Vida deudores","Axa Colpatria Seguros de Vida","860002183-9","2023-11-01","2025-11-01","Saldo de deuda","Créditos nuevos y antiguos hasta con una mora máxima de 5 cuotas",4.1000000000000002E-2,4.1000000000000002E-2,4.1000000000000002E-2,4.1000000000000002E-2,4.1000000000000002E-2,4.1000000000000002E-2]
["Empresarial y comercial","CON garantía hipotecaria","Vida deudores","Axa Colpatria Seguros de Vida","860002183-9","2023-11-01","2025-11-01","Saldo de deuda","Créditos nuevos y antiguos hasta con una mora máxima de 2 cuotas",4.1000000000000002E-2,4.1000000000000002E-2,4.1000000000000002E-2,4.1000000000000002E-2,4.1000000000000002E-2,4.1000000000000002E-2]
["Consumo con garantía hipotecaria","CON garantía hipotecaria","Vida deudores","Axa Colpatria Seguros de Vida","860002183-9","2023-11-01","2025-11-01","Monto del desembolso","Créditos radicados desde la fecha de inicio de vigencia hasta con una mora máxima de 2 cuotas.  Los créditos radicados con anterioridad, conservan el factor con el cual se realizó el desembolso",4.1000000000000002E-2,4.1000000000000002E-2,4.1000000000000002E-2,4.1000000000000002E-2,4.1000000000000002E-2,4.1000000000000002E-2]
["Hipotecario largo plazo","SIN garantía hipotecaria","Vida deudores","Seguros de Vida Alfa","860503617-3","2023-05-01","2024-05-01","Saldo de deuda","Créditos nuevos y antiguos hasta con una mora máxima de 5 cuotas",6.9499999999999992E-2,8.9900000000000008E-2,9.2799999999999994E-2,0.27139999999999997,0.65179999999999993,1.0725]
["Empresarial y comercial","SIN garantía hipotecaria","Vida deudores","Seguros de Vida Alfa","860503617-3","2023-05-01","2024-05-01","Saldo de deuda","Créditos nuevos y antiguos hasta con una mora máxima de 2 cuotas",6.9499999999999992E-2,8.9900000000000008E-2,9.2799999999999994E-2,0.27139999999999997,0.65179999999999993,1.0725]
["Consumo","SIN garantía hipotecaria","Vida deudores","Seguros de Vida Alfa","860503617-3","2023-05-01","2024-05-01","Monto del desembolso","Créditos radicados desde la fecha de inicio de vigencia hasta con una mora máxima de 2 cuotas.  Los créditos radicados con anterioridad, conservan el factor con el cual se realizó el desembolso",6.9499999999999992E-2,8.9900000000000008E-2,9.2799999999999994E-2,0.27139999999999997,0.65179999999999993,1.0725,{"$f":"+AVERAGE(J10:O10)/100","v":3.7464999999999994E-3}]
["Libranza","SIN garantía hipotecaria","Vida deudores","Seguros de Vida Alfa","860503617-3","2023-05-01","2024-05-01","Monto del desembolso","Créditos radicados desde la fecha de inicio de vigencia hasta con una mora máxima de 2 cuotas.  Los créditos radicados con anterioridad, conservan el factor con el cual se realizó el desembolso",6.9499999999999992E-2,8.9900000000000008E-2,9.2799999999999994E-2,0.27139999999999997,0.65179999999999993,1.0725]
[]
["LINEA DE CRÉDITO","ASOCIACIÓN DE GARANTÍA HIPOTECARIA","TIPO DE SEGURO","ASEGURADORA","NIT","VIGENCIA DE LOS FACTORES",null,"VALOR ASEGURADO \n","CONDICIONES DE COBRO","TASA MENSUAL EN % PARA COBRO DE SEGURO DE INCENDIO Y TERREMOTO"]
[null,null,null,null,null,"DESDE","HASTA"]
["Todas las líneas","CON garantía hipotecaria","Incendio","Seguros Alfa S.A.","860031979-8","2023-11-01","2025-11-01","Valor destructible del inmueble\n","Créditos nuevos y antiguos con cualquier altura de mora",6.4999999999999997E-4,null,null,null,null,null,{"$f":"+J15/100","v":6.4999999999999996E-6}]
["Todas las líneas","CON garantía hipotecaria","Terremoto","Seguros Alfa S.A.","860031979-8","2023-11-01","2025-11-01","Valor destructible del inmueble\n","Créditos nuevos y antiguos con cualquier altura de mora",1.235E-2,null,null,null,null,null,{"$f":"+J16/100","v":1.2349999999999999E-4}]
[null,null,null,null,null,null,null,null,null,null,null,null,null,null,null,{"$f":"SUM(P15:P16)","v":1.2999999999999999E-4}]
["TIPO DE TARJETA","ASOCIACIÓN DE GARANTÍA HIPOTECARIA","TIPO DE SEGURO","ASEGURADORA","NIT","VIGENCIA DE LOS FACTORES",null,"VALOR ASEGURADO \n","CONDICIONES DE COBRO","FACTOR FIJO EN PESOS PARA COBRO DE SEGURO DE VIDA"]
[null,null,null,null,null,"DESDE","HASTA"]
["facilisima ","SIN garantía hipotecaria","Vida deudores","Seguros de Vida Alfa","860503617-3","2023-11-01","2024-11-01","Saldo de deuda","Titular de la tarjeta (no cubre amparados)\nSaldo de deuda mayor a $10.000",3699]
{"$rows_left_out":5}