{"text_format":"1","workbook":"xlsx","n_sheets":3,"sheets":["Formulario","Variables","Simulador"],"not_rendered":{"charts":0,"images":2,"macros":1,"external_links":1,"defined_names":0,"comments":0,"pivot_tables":0},"unopened":[],"bounds":{"document_bytes":16777216,"sheet_cells":100000,"rows_first":2000,"rows_last":500,"rows_between":2000,"halvings":0,"cell_chars":16384,"cell_head_chars":4096},"cells_cut":0,"cells_raw":0,"read":"whole","date_system":"1900"}

{"sheet":"Formulario","index":0,"n_rows":17,"n_cols":4,"rows_kept":17,"cut":false,"hidden":false,"merged":[[4,1,5,6]]}
[]
[]
[]
[]
[null,"INGRESE LOS DATOS PARA SIMULAR EL VALOR TOTAL UNIFICADO DEL CRÉDITO EDUCATIVO"]
[]
[]
[null,null,"  Digite el valor del crédito",20000000]
[null,null,"  Digite el Plazo (Entre 6 y 60 meses)",48]
[null,null,"  Digite la Tasa Efectiva Anual",0.14000000000000001]
[null,null,"  Elija el Rango de edad del deudor","De 18 a 50 años"]
[null,null,"  Elija el Tipo de Estudio de Crédito","Libre Inversión"]
[null,null,"  Elija el Tipo de Desembolso","Transferencia bancaria"]
[null,null,"  Elija el Canal de Solicitud","Of. Tradicional/Preferente"]
[null,null,"  Con garantía hipotecaria","No"]
[null,null,"  Tipo de inmueble (de la garantía)","N/A"]
[null,null,"  Valor del avalúo comercial de la garantía",0]

{"sheet":"Variables","index":1,"n_rows":46,"n_cols":13,"rows_kept":46,"cut":false,"hidden":true,"merged":[[1,8,1,10],[2,11,2,12],[11,11,11,12],[19,11,19,12]]}
[]
[null,"LISTA DESPLEGABLE",null,null,null,"TARIFAS",null,null,"FACTOR MENSUAL PARA COBRO DE SEGUROS"]
[null,null,null,null,null,"TARIFARIO A partir del 05 de Junio de 2023","IVA INCLUIDO",null,"Hipotecarios:",null,null,"VALOR DEL SEGURO"]
[null,"Rango de edad del deudor",null,23600,null,"Simulación de Crédito Oficinas Tradicionales / Banca Preferente",{"$f":"D4*1.19","v":28084},null,"Edad","Con garantía hipotecaria","Sin garantía hipotecaria","Con garantía hipotecaria","Sin garantía hipotecaria"]
[null,"Entre 18 y 70 años",null,35150,null,"Simulación de Crédito OCI (Oficinas de Crédito al Instante)",{"$f":"D5*1.19","v":41828.5},null,"Entre 18 y 51 años",4.4000000000000002E-4,6.9499999999999998E-4,0,0]
[null,"71 años en adelante",null,102300,null,"Estudio de Crédito Compra de Cartera",121737,null,"Entre 51 y 60 años",4.4000000000000002E-4,8.9900000000000006E-4,0,0]
[null,null,null,112500,null,"Estudio de Crédito Libre Inversión",133875,null,"Entre 61 y 70 años",4.4000000000000002E-4,9.2800000000000001E-4,0,0]
[null,"Tipo de Estudio de Crédito",null,null,null,null,null,null,"Entre 71 y 75 años",4.4000000000000002E-4,2.7139999999999998E-3,0,0]
[null,"Libre Inversión",null,null,null,"Otros servicios",null,null,"Entre 76 y 80 años",4.4000000000000002E-4,6.5179999999999995E-3,0,0]
[null,"Compra de cartera",null,13300,null,"Certificaciones",{"$f":"D10*1.19","v":15827},null,"81 años en adelante",4.4000000000000002E-4,1.0725E-2,0,0]
[null,null,null,27450,null,"Crédito educativo Desembolso con Cheque",{"$f":"D11*1.19","v":32665.5}]
[null,null,null,30300,null,"Crédito educativo Desembolso con Transferencia",36057,null,"Consumo, educativo, libranza:",null,null,"VALOR DEL SEGURO"]
[null,"Tipo de Desembolso",null,36900,null,"Desembolso con Cheque (cada uno)",43911,null,"Edad","Con garantía hipotecaria","Sin garantía hipotecaria","Con garantía hipotecaria","Sin garantía hipotecaria"]
[null,"Cheque de Gerencia",null,33200,null,"Desembolso con Transferencia (cada una)",39508,null,"Entre 18 y 51 años",4.4000000000000002E-4,6.9499999999999998E-4,{"$f":"Formulario!$D$8*Variables!$J14","v":8800},{"$f":"Formulario!$D$8*Variables!$K14","v":13900}]
[null,"Transferencia bancaria",null,null,null,null,null,null,"Entre 51 y 60 años",4.4000000000000002E-4,8.9900000000000006E-4,{"$f":"Formulario!$D$8*Variables!$J15","v":8800},{"$f":"Formulario!$D$8*Variables!$K15","v":17980}]
[null,null,null,null,null,null,null,null,"Entre 61 y 70 años",4.4000000000000002E-4,9.2800000000000001E-4,{"$f":"Formulario!$D$8*Variables!$J16","v":8800},{"$f":"Formulario!$D$8*Variables!$K16","v":18560}]
[null,null,null,null,null,null,null,null,"Entre 71 y 75 años",4.4000000000000002E-4,2.7139999999999998E-3,{"$f":"Formulario!$D$8*Variables!$J17","v":8800},{"$f":"Formulario!$D$8*Variables!$K17","v":54280}]
[null,"Tipo de Oficina de Solicitud",null,null,null,null,null,null,"Entre 76 y 80 años",4.4000000000000002E-4,6.5179999999999995E-3,{"$f":"Formulario!$D$8*Variables!$J18","v":8800},{"$f":"Formulario!$D$8*Variables!$K18","v":130359.99999999999}]
[null,"Of. Tradicional/Preferente",null,null,null,null,null,null,"81 años en adelante",4.4000000000000002E-4,1.0725E-2,{"$f":"Formulario!$D$8*Variables!$J19","v":8800},{"$f":"Formulario!$D$8*Variables!$K19","v":214500}]
[null,"Oficina de Crédito al Instante",null,null,null,null,null,null,null,null,null,"VALOR DEL SEGURO"]
[null,"Internet /Exento",null,null,null,null,null,null,null,null,null,"Con garantía hipotecaria","Sin garantía hipotecaria"]
[null,null,null,null,null,null,null,null,"Incendio y terremoto",1.4999999999999999E-4,0,{"$f":"VLOOKUP(Formulario!$D$16,$B$36:$D$46,3,0)*$J$22","v":0},0]
[null,"Con garantía hipotecaria",null,null,null,null,null,null,"Aplica si tiene garantía hipotecaria"]
[null,"Si"]
[null,"No"]
[]
[null,"Edad"]
[null,"Entre 18 y 51 años"]
[null,"Entre 51 y 60 años"]
[null,"Entre 61 y 70 años"]
[null,"Entre 71 y 75 años"]
[null,"Entre 76 y 80 años"]
[null,"81 años en adelante"]
[]
[null,"  Tipo de inmueble","% Destructible","Base de liquidación"]
[null,"Casa",0.85,{"$f":"IF(Formulario!$D$15=\"No\",0,Formulario!$D$17*Variables!$C36)","v":0}]
[null,"Apartamento",0.95,{"$f":"IF(Formulario!$D$15=\"No\",0,Formulario!$D$17*Variables!$C37)","v":0}]
[null,"Consultorio",0.95,{"$f":"IF(Formulario!$D$15=\"No\",0,Formulario!$D$17*Variables!$C38)","v":0}]
[null,"Oficina",0.95,{"$f":"IF(Formulario!$D$15=\"No\",0,Formulario!$D$17*Variables!$C39)","v":0}]
[null,"Bodega",0.85,{"$f":"IF(Formulario!$D$15=\"No\",0,Formulario!$D$17*Variables!$C40)","v":0}]
{"$rows_left_out":7}
{"sheet":"Simulador","index":2,"n_rows":321,"n_cols":24,"rows_kept":321,"cut":false,"hidden":true,"merged":[[32,1,38,2],[17,8,17,13],[17,15,17,23],[8,19,8,20],[13,19,13,20],[11,18,12,18],[9,18,10,18],[14,19,14,20],[13,18,14,18],[4,1,5,2]]}
[null,null,null,null,null,null,null,null,null,null,null,null,null,null,null,null,null,null,null,"TASA MENSUAL EN % POR RANGOS DE EDAD PARA COBRO DE SEGURO DE VIDA","factor","div 100"]
[null,null,null,null,null,null,null,null,null,null,null,null,null,null,null,null,null,null,null,"De 18 a 50 años",6.9499999999999992E-2,{"$f":"+U2/100","v":6.9499999999999987E-4}]
[null,null,null,null,null,null,null,null,null,null,null,null,null,null,null,null,null,null,null,"De 51 a 60 años",8.9900000000000008E-2,{"$f":"+U3/100","v":8.9900000000000006E-4}]
[null,null,null,null,null,null,null,null,null,null,null,null,null,null,null,null,null,null,null,"De 61 a 70 años",9.2799999999999994E-2,9.279999999999999E-4]
[null,"SIMULACIÓN VALOR TOTAL UNIFICADO DEL CRÉDITO DEL CRÉDITO EDUCATIVO",null,null,null,null,null,null,null,null,null,null,null,null,null,null,null,null,null,"De 71 a 75 años",0.27139999999999997,2.7139999999999998E-3]
[null,null,null,null,null,null,null,null,null,null,null,null,null,null,null,null,null,null,null,"De 76 a 80 años",0.65179999999999993,6.5179999999999995E-3]
[null,null,{"$f":"TODAY()","v":"2025-10-17"},null,null,null,null,null,null,null,null,null,null,null,null,null,null,null,null,"Desde 81 años",1.0725,1.0725E-2]
[null,"  Monto del Crédito",{"$f":"Formulario!$D$8","v":20000000}]
[null,"  Plazo (meses)",{"$f":"Formulario!$D$9","v":48},null,null,null,null,null,null,null,null,null,null,null,null,null,"Certificaciones",{"$f":"+[1]Tarifas!$M$298","v":15600},null,"TARIFAS PRODUCTOS Y SERVICIOS BANCARIOS",null,"A partir del 04 de SEPTIEMBRE de 2025"]
[null,"  Tasa Efectiva Anual",{"$f":"Formulario!$D$10","v":0.14000000000000001},null,null,null,null,null,null,null,null,null,null,null,null,null,null,null,"Estudio de Crédito","Estudio de Crédito Compra de Cartera",null,{"$f":"+[1]Tarifas!$M$294","v":180000}]
[null,"  Valor 1ra. Cuota sin Seguros",{"$f":"$M$22","v":538284.92917156115},null,null,null,null,null,null,null,null,null,null,null,null,null,null,null,null,"Estudio de Crédito Libre Inversión",null,{"$f":"+[1]Tarifas!$M$295","v":181000}]
[null,"  Rango Edad Deudor",{"$f":"Formulario!$D$11","v":"De 18 a 50 años"},null,null,null,null,null,null,null,null,null,null,null,null,null,null,null,"Tipo de Desembolso","Crédito educativo Desembolso con Cheque",null,{"$f":"+[1]Tarifas!$M$299","v":31950}]
[null,"  Tipo Estudio de Crédito",{"$f":"Formulario!$D$12","v":"Libre Inversión"},null,null,null,null,null,null,null,null,null,null,null,null,null,null,null,null,"Crédito educativo Desembolso con Transferencia",null,{"$f":"+[1]Tarifas!$M$300","v":35250}]
[null,"  Tipo Desembolso",{"$f":"Formulario!$D$13","v":"Transferencia bancaria"},null,null,null,null,null,null,null,null,null,null,null,null,null,null,null,"Tipo canal","Simulación de Crédito Oficinas Tradicionales / Banca Preferente",null,{"$f":"+[1]Tarifas!$M$292","v":31600}]
[null,"  Tipo de Canal de Solicitud",{"$f":"Formulario!$D$14","v":"Of. Tradicional/Preferente"},null,null,null,null,null,null,null,null,null,null,null,null,null,null,null,null,"Simulación de Crédito OCI (Oficinas de Crédito al Instante)",null,{"$f":"+[1]Tarifas!$M$293","v":40900}]
[null,"  Con garantía hipotecaria",{"$f":"Formulario!$D$15","v":"No"},null,null,null,null,null,null,"TNM",{"$f":"NOMINAL(Formulario!$D$10,12)/12","v":1.0978851950173452E-2},null,null,null,null,null,null,null,null,null,null,null,"VTUA%",{"$f":"IRR(X21:X321)","v":1.2280233367008675E-2}]
[null,"  Tipo de inmueble (de la garantía)",{"$f":"Formulario!$D$16","v":"N/A"}]
[null,"  Valor del avalúo comercial de la garantía",{"$f":"Formulario!$D$17","v":0},null,null,null,null,null,"FLUJO DEL CRÉDITO",null,null,null,null,null,null,"FLUJO DEL CLIENTE"]
[]
[null,"VALOR TOTAL UNIFICADO",null,null,null,null,null,null,"Periodo","Capital","Intereses","Abono a Capital","Cuota","Saldo",null,"Desembolso","Cuota","Certificaciones","Estudio de Crédito","Tipo de Desembolso","Tipo de canal","Seguro de vida","Seguro de incendio y terremoto","Saldo cliente"]
[null,"  Valor Total Unificado %",{"$f":"(1+X16)^12-1","v":0.15773477489295185},null,null,null,null,null,0,null,null,null,null,{"$f":"$C$8","v":20000000},null,{"$f":"N21","v":20000000},0,{"$f":"-R9","v":-15600},{"$f":"-IF(C13=\"Libre Inversión\",$V$11,V10)","v":-181000},{"$f":"-IF(C14=\"Cheque de Gerencia\",$V$12,V13)","v":-35250},{"$f":"-IF(C15=\"Of. Tradicional/Preferente\",$V$14,$V$15)","v":-31600},0,0,{"$f":"SUM(P21:W21)","v":19736550}]
[null,"  Valor Total Unificado $",{"$f":"SUM(K22:K321)-SUM(R21:W321)","v":6470672.0914735859},null,null,null,null,null,1,{"$f":"N21","v":20000000},{"$f":"J22*$K$16","v":219577.03900346902},{"$f":"IF(I22<>0,M22-K22,0)","v":318707.8901680921},{"$f":"IF(I22<>0,PMT($K$16,Formulario!$D$9,-Simulador!$N$21),0)","v":538284.92917156115},{"$f":"J22-L22","v":19681292.109831907},null,0,{"$f":"IF(M22=0,0,-M22)","v":-538284.92917156115},0,0,0,0,{"$f":"-(VLOOKUP($C$12,$T$1:$V$7,3,0)*N21)","v":-13899.999999999998},{"$f":"IF(I22<>0,IF($C$16=\"No\",0,-Variables!$L$22),0)","v":0},-552184.92917156115]
[null,"    Intereses",{"$f":"SUM(K22:K321)","v":5837676.6002349341},null,null,null,null,null,{"$f":"IF(AND(I22+1<=Formulario!$D$9,I22<>0),I22+1,0)","v":2},{"$f":"IF(I23<>0,N22,0)","v":19681292.109831907},{"$f":"J23*$K$16","v":216077.99226196139},{"$f":"IF(I23<>0,M23-K23,0)","v":322206.93690959975},{"$f":"IF(I23<>0,PMT($K$16,Formulario!$D$9,-Simulador!$N$21),0)","v":538284.92917156115},{"$f":"J23-L23","v":19359085.172922306},null,0,{"$f":"IF(M23=0,0,-M23)","v":-538284.92917156115},0,0,0,0,{"$f":"-(VLOOKUP($C$12,$T$1:$V$7,3,0)*N22)","v":-13678.498016333173},{"$f":"IF(I23<>0,IF($C$16=\"No\",0,-Variables!$L$22),0)","v":0},-551963.42718789435]
[null,"    Certificaciones",{"$f":"-R21","v":15600},null,null,null,null,null,{"$f":"IF(AND(I23+1<=Formulario!$D$9,I23<>0),I23+1,0)","v":3},{"$f":"IF(I24<>0,N23,0)","v":19359085.172922306},212540.53000431202,325744.3991672491,{"$f":"IF(I24<>0,PMT($K$16,Formulario!$D$9,-Simulador!$N$21),0)","v":538284.92917156115},19033340.773755055,null,0,-538284.92917156115,0,0,0,0,-13454.564195180999,{"$f":"IF(I24<>0,IF($C$16=\"No\",0,-Variables!$L$22),0)","v":0},-551739.49336674216]
[null,"    Estudio de Crédito",{"$f":"-S21","v":181000},null,null,null,null,null,{"$f":"IF(AND(I24+1<=Formulario!$D$9,I24<>0),I24+1,0)","v":4},19033340.773755055,208964.23047225655,329320.6986993046,{"$f":"IF(I25<>0,PMT($K$16,Formulario!$D$9,-Simulador!$N$21),0)","v":538284.92917156115},18704020.075055752,null,0,-538284.92917156115,0,0,0,0,-13228.171837759761,{"$f":"IF(I25<>0,IF($C$16=\"No\",0,-Variables!$L$22),0)","v":0},-551513.10100932093]
[null,"    Tipo de Desembolso",{"$f":"-T21","v":35250},null,null,null,null,null,{"$f":"IF(AND(I25+1<=Formulario!$D$9,I25<>0),I25+1,0)","v":5},18704020.075055752,205348.66727710923,332936.26189445192,{"$f":"IF(I26<>0,PMT($K$16,Formulario!$D$9,-Simulador!$N$21),0)","v":538284.92917156115},18371083.813161299,null,0,-538284.92917156115,0,0,0,0,-12999.293952163745,{"$f":"IF(I26<>0,IF($C$16=\"No\",0,-Variables!$L$22),0)","v":0},-551284.22312372492]
[null,"    Canal de solicitud",{"$f":"-U21","v":31600},null,null,null,null,null,{"$f":"IF(AND(I26+1<=Formulario!$D$9,I26<>0),I26+1,0)","v":6},18371083.813161299,201693.40934892587,336591.51982263528,{"$f":"IF(I27<>0,PMT($K$16,Formulario!$D$9,-Simulador!$N$21),0)","v":538284.92917156115},18034492.293338664,null,0,-538284.92917156115,0,0,0,0,-12767.903250147101,{"$f":"IF(I27<>0,IF($C$16=\"No\",0,-Variables!$L$22),0)","v":0},-551052.83242170827]
[null,"    Seguro de vida del deudor",{"$f":"-SUM(V21:V321)","v":369545.49123865203},null,null,null,null,null,{"$f":"IF(AND(I27+1<=Formulario!$D$9,I27<>0),I27+1,0)","v":7},18034492.293338664,197998.02088510926,340286.90828645189,{"$f":"IF(I28<>0,PMT($K$16,Formulario!$D$9,-Simulador!$N$21),0)","v":538284.92917156115},17694205.385052212,null,0,-538284.92917156115,0,0,0,0,-12533.972143870369,{"$f":"IF(I28<>0,IF($C$16=\"No\",0,-Variables!$L$22),0)","v":0},-550818.90131543146]
[null,"    Seguro de Incendio y Terremoto",{"$f":"-SUM(W21:W321)","v":0},null,null,null,null,null,{"$f":"IF(AND(I28+1<=Formulario!$D$9,I28<>0),I28+1,0)","v":8},17694205.385052212,194262.06129845008,344022.86787311104,{"$f":"IF(I29<>0,PMT($K$16,Formulario!$D$9,-Simulador!$N$21),0)","v":538284.92917156115},17350182.517179102,null,0,-538284.92917156115,0,0,0,0,-12297.472742611284,{"$f":"IF(I29<>0,IF($C$16=\"No\",0,-Variables!$L$22),0)","v":0},-550582.40191417246]
[null,null,null,null,null,null,null,null,{"$f":"IF(AND(I29+1<=Formulario!$D$9,I29<>0),I29+1,0)","v":9},17350182.517179102,190485.08516459711,347799.84400696401,{"$f":"IF(I30<>0,PMT($K$16,Formulario!$D$9,-Simulador!$N$21),0)","v":538284.92917156115},17002382.673172139,null,0,-538284.92917156115,0,0,0,0,-12058.376849439474,{"$f":"IF(I30<>0,IF($C$16=\"No\",0,-Variables!$L$22),0)","v":0},-550343.30602100061]
[null,null,null,null,null,null,null,null,{"$f":"IF(AND(I30+1<=Formulario!$D$9,I30<>0),I30+1,0)","v":10},17002382.673172139,186666.64216895125,351618.28700260993,{"$f":"IF(I31<>0,PMT($K$16,Formulario!$D$9,-Simulador!$N$21),0)","v":538284.92917156115},16650764.386169529,null,0,-538284.92917156115,0,0,0,0,-11816.655957854635,{"$f":"IF(I31<>0,IF($C$16=\"No\",0,-Variables!$L$22),0)","v":0},-550101.58512941573]
[null,"Nota:",null,null,null,null,null,null,{"$f":"IF(AND(I31+1<=Formulario!$D$9,I31<>0),I31+1,0)","v":11},16650764.386169529,182806.27705297599,355478.65211858519,{"$f":"IF(I32<>0,PMT($K$16,Formulario!$D$9,-Simulador!$N$21),0)","v":538284.92917156115},16295285.734050943,null,0,-538284.92917156115,0,0,0,0,-11572.281248387821,{"$f":"IF(I32<>0,IF($C$16=\"No\",0,-Variables!$L$22),0)","v":0},-549857.21041994891]
[null,"El Valor Total Unificado corresponde a una proyección de los cobros inherentes o asociados al crédito simulado. \n\nLos valores aquí presentados resultan de una proyección por lo tanto no necesariamente corresponden a los valores que va a pagar con su producto.",null,null,null,null,null,null,{"$f":"IF(AND(I32+1<=Formulario!$D$9,I32<>0),I32+1,0)","v":12},16295285.734050943,178903.52955991882,359381.39961164235,{"$f":"IF(I33<>0,PMT($K$16,Formulario!$D$9,-Simulador!$N$21),0)","v":538284.92917156115},15935904.3344393,null,0,-538284.92917156115,0,0,0,0,-11325.223585165402,{"$f":"IF(I33<>0,IF($C$16=\"No\",0,-Variables!$L$22),0)","v":0},-549610.1527567266]
[null,null,null,null,null,null,null,null,{"$f":"IF(AND(I33+1<=Formulario!$D$9,I33<>0),I33+1,0)","v":13},15935904.3344393,174957.93437993646,363326.99479162472,{"$f":"IF(I34<>0,PMT($K$16,Formulario!$D$9,-Simulador!$N$21),0)","v":538284.92917156115},15572577.339647675,null,0,-538284.92917156115,0,0,0,0,-11075.453512435311,{"$f":"IF(I34<>0,IF($C$16=\"No\",0,-Variables!$L$22),0)","v":0},-549360.38268399646]
[null,null,null,null,null,null,null,null,{"$f":"IF(AND(I34+1<=Formulario!$D$9,I34<>0),I34+1,0)","v":14},15572577.339647675,170969.02109461778,367315.90807694336,{"$f":"IF(I35<>0,PMT($K$16,Formulario!$D$9,-Simulador!$N$21),0)","v":538284.92917156115},15205261.431570731,null,0,-538284.92917156115,0,0,0,0,-10822.941251055132,{"$f":"IF(I35<>0,IF($C$16=\"No\",0,-Variables!$L$22),0)","v":0},-549107.87042261625]
[null,null,null,null,null,null,null,null,{"$f":"IF(AND(I35+1<=Formulario!$D$9,I35<>0),I35+1,0)","v":15},15205261.431570731,166936.3141208975,371348.61505066365,{"$f":"IF(I36<>0,PMT($K$16,Formulario!$D$9,-Simulador!$N$21),0)","v":538284.92917156115},14833912.816520067,null,0,-538284.92917156115,0,0,0,0,-10567.656694941656,{"$f":"IF(I36<>0,IF($C$16=\"No\",0,-Variables!$L$22),0)","v":0},-548852.58586650284]
[null,null,null,null,null,null,null,null,{"$f":"IF(AND(I36+1<=Formulario!$D$9,I36<>0),I36+1,0)","v":16},14833912.816520067,162859.33265435431,375425.59651720687,{"$f":"IF(I37<>0,PMT($K$16,Formulario!$D$9,-Simulador!$N$21),0)","v":538284.92917156115},14458487.22000286,null,0,-538284.92917156115,0,0,0,0,-10309.569407481444,{"$f":"IF(I37<>0,IF($C$16=\"No\",0,-Variables!$L$22),0)","v":0},-548594.49857904261]
[null,null,null,null,null,null,null,null,{"$f":"IF(AND(I37+1<=Formulario!$D$9,I37<>0),I37+1,0)","v":17},14458487.22000286,158737.59061188632,379547.3385596748,{"$f":"IF(I38<>0,PMT($K$16,Formulario!$D$9,-Simulador!$N$21),0)","v":538284.92917156115},14078939.881443186,null,0,-538284.92917156115,0,0,0,0,-10048.648617901985,{"$f":"IF(I38<>0,IF($C$16=\"No\",0,-Variables!$L$22),0)","v":0},-548333.5777894631]
[null,null,null,null,null,null,null,null,{"$f":"IF(AND(I38+1<=Formulario!$D$9,I38<>0),I38+1,0)","v":18},14078939.881443186,154570.5965737573,383714.33259780385,{"$f":"IF(I39<>0,PMT($K$16,Formulario!$D$9,-Simulador!$N$21),0)","v":538284.92917156115},13695225.548845382,null,0,-538284.92917156115,0,0,0,0,-9784.8632176030114,{"$f":"IF(I39<>0,IF($C$16=\"No\",0,-Variables!$L$22),0)","v":0},-548069.79238916421]
[null,null,null,null,null,null,null,null,{"$f":"IF(AND(I39+1<=Formulario!$D$9,I39<>0),I39+1,0)","v":19},13695225.548845382,150357.8537250064,387927.07544655475,{"$f":"IF(I40<>0,PMT($K$16,Formulario!$D$9,-Simulador!$N$21),0)","v":538284.92917156115},13307298.473398827,null,0,-538284.92917156115,0,0,0,0,-9518.1817564475386,{"$f":"IF(I40<>0,IF($C$16=\"No\",0,-Variables!$L$22),0)","v":0},-547803.11092800868]
{"$rows_left_out":281}